Reaction Details
TargetMitogen-activated protein kinase 14
LigandBDBM50277627
Substrate/Competitorn/a
Meas. Tech.ChEMBL_501500 (CHEMBL984139)
IC50 3900±n/a nM
Citation Cirillo, PFHickey, ERMoss, NBreitfelder, SBetageri, RFadra, TGaenzler, FGilmore, TGoldberg, DRKamhi, VKirrane, TKroe, RRMadwed, JMoriak, MNetherton, MPargellis, CAPatel, URQian, KCSharma, RSun, SSwinamer, ATorcellini, CTakahashi, HTsang, MXiong, Z Discovery and characterization of the N-phenyl-N'-naphthylurea class of p38 kinase inhibitors. Bioorg Med Chem Lett19:2386-91 (2009) 
 
Mitogen-activated protein kinase 14
Name:Mitogen-activated protein kinase 14
Type:Serine/threonine-protein kinase
Mol. Mass.:41286.76
Organism:Homo sapiens (Human)
Description:Q16539
Residue:360
BDBM50277627
NameBDBM50277627
Synonyms:1-(5-tert-butyl-2-methoxyphenyl)-3-(naphthalen-1-yl)urea | CHEMBL482969
TypeSmall organic molecule
Emp. Form.C22H24N2O2
Mol. Mass.348.4382
SMILESCOc1ccc(cc1NC(=O)Nc1cccc2ccccc12)C(C)(C)C