Reaction Details
TargetMitogen-activated protein kinase 14
LigandBDBM50277663
Substrate/Competitorn/a
Meas. Tech.ChEMBL_501500 (CHEMBL984139)
IC50>10000±n/a nM
Citation Cirillo, PFHickey, ERMoss, NBreitfelder, SBetageri, RFadra, TGaenzler, FGilmore, TGoldberg, DRKamhi, VKirrane, TKroe, RRMadwed, JMoriak, MNetherton, MPargellis, CAPatel, URQian, KCSharma, RSun, SSwinamer, ATorcellini, CTakahashi, HTsang, MXiong, Z Discovery and characterization of the N-phenyl-N'-naphthylurea class of p38 kinase inhibitors. Bioorg Med Chem Lett19:2386-91 (2009) 
 
Mitogen-activated protein kinase 14
Name:Mitogen-activated protein kinase 14
Type:Serine/threonine-protein kinase
Mol. Mass.:41286.76
Organism:Homo sapiens (Human)
Description:Q16539
Residue:360
BDBM50277663
NameBDBM50277663
Synonyms:CHEMBL519511 | N-(5-tert-butyl-2-methoxyphenyl)benzo[b]thiophene-2-carboxamide
TypeSmall organic molecule
Emp. Form.C20H21NO2S
Mol. Mass.339.451
SMILESCOc1ccc(cc1NC(=O)c1cc2ccccc2s1)C(C)(C)C