Reaction Details
TargetMitogen-activated protein kinase 14
LigandBDBM50218695
Substrate/Competitorn/a
Meas. Tech.ChEMBL_501500 (CHEMBL984139)
IC50 4100±n/a nM
Citation Cirillo, PFHickey, ERMoss, NBreitfelder, SBetageri, RFadra, TGaenzler, FGilmore, TGoldberg, DRKamhi, VKirrane, TKroe, RRMadwed, JMoriak, MNetherton, MPargellis, CAPatel, URQian, KCSharma, RSun, SSwinamer, ATorcellini, CTakahashi, HTsang, MXiong, Z Discovery and characterization of the N-phenyl-N'-naphthylurea class of p38 kinase inhibitors. Bioorg Med Chem Lett19:2386-91 (2009) 
 
Mitogen-activated protein kinase 14
Name:Mitogen-activated protein kinase 14
Type:Serine/threonine-protein kinase
Mol. Mass.:41286.76
Organism:Homo sapiens (Human)
Description:Q16539
Residue:360
BDBM50218695
NameBDBM50218695
Synonyms:CHEMBL390254 benzofuran-2-carboxylic acid (5-tert-Butyl-3-methanesulfonylamino-2-methoxy-phenyl)-amide
TypeSmall organic molecule
Emp. Form.C21H24N2O5S
Mol. Mass.416.491
SMILESCOc1c(NC(=O)c2cc3ccccc3o2)cc(cc1NS(C)(=O)=O)C(C)(C)C