Reaction Details
TargetMitogen-activated protein kinase 14
LigandBDBM50277615
Substrate/Competitorn/a
Meas. Tech.ChEMBL_501498 (CHEMBL984137)
Kd 1.8±n/a nM
Citation Cirillo, PFHickey, ERMoss, NBreitfelder, SBetageri, RFadra, TGaenzler, FGilmore, TGoldberg, DRKamhi, VKirrane, TKroe, RRMadwed, JMoriak, MNetherton, MPargellis, CAPatel, URQian, KCSharma, RSun, SSwinamer, ATorcellini, CTakahashi, HTsang, MXiong, Z Discovery and characterization of the N-phenyl-N'-naphthylurea class of p38 kinase inhibitors. Bioorg Med Chem Lett19:2386-91 (2009) 
 
Mitogen-activated protein kinase 14
Name:Mitogen-activated protein kinase 14
Type:Serine/threonine-protein kinase
Mol. Mass.:41286.76
Organism:Homo sapiens (Human)
Description:Q16539
Residue:360
BDBM50277615
NameBDBM50277615
Synonyms:1-(5-tert-butyl-2-methoxyphenyl)-3-(4-(6-(morpholinomethyl)pyridin-3-yl)naphthalen-1-yl)urea | CHEMBL523978
TypeSmall organic molecule
Emp. Form.C32H36N4O3
Mol. Mass.524.6532
SMILESCOc1ccc(cc1NC(=O)Nc1ccc(-c2ccc(CN3CCOCC3)nc2)c2ccccc12)C(C)(C)C