Reaction Details
TargetMelanin-concentrating hormone receptor 1
LigandBDBM50258478
Substrate/Competitorn/a
Meas. Tech.ChEMBL_500270 (CHEMBL969605)
IC50 0.09±n/a nM
Citation Suzuki, TMoriya, MSakamoto, TSuga, TKishino, HTakahashi, HIshikawa, MNagai, KImai, YSekino, EIto, MIwaasa, HIshihara, ATokita, SKanatani, ASato, NFukami, T Discovery of novel spiro-piperidine derivatives as highly potent and selective melanin-concentrating hormone 1 receptor antagonists. Bioorg Med Chem Lett19:3072-7 (2009) 
 
Melanin-concentrating hormone receptor 1
Name:Melanin-concentrating hormone receptor 1
Type:G Protein-Coupled Receptor (GPCR)
Mol. Mass.:45976.27
Organism:Homo sapiens (Human)
Description:Membranes from CHO-K1 cells stably expressing human MCH1R were used in assays.
Residue:422
BDBM50258478
NameBDBM50258478
Synonyms:2-(3,4-difluorophenyl)-N-(3-(6-fluoro-1H-spiro[furo[3,4-c]pyridine-3,4'-piperidine]-1'-yl)propyl)-N-(2-fluoroethyl)-2-(1H-pyrazol-1-yl)acetamide | CHEMBL468099
TypeSmall organic molecule
Emp. Form.C27H29F4N5O2
Mol. Mass.531.5451
SMILESFCCN(CCCN1CCC2(CC1)OCc1cc(F)ncc21)C(=O)C(c1ccc(F)c(F)c1)n1cccn1