Reaction Details
TargetOrexin receptor type 2
LigandBDBM50258773
Substrate/Competitorn/a
Meas. Tech.ChEMBL_500316 (CHEMBL973408)
Ki 240±n/a nM
Citation Cox, CDMcGaughey, GBBogusky, MJWhitman, DBBall, RGWinrow, CJRenger, JJColeman, PJ Conformational analysis of N,N-disubstituted-1,4-diazepane orexin receptor antagonists and implications for receptor binding. Bioorg Med Chem Lett19:2997-3001 (2009) 
 
Orexin receptor type 2
Name:Orexin receptor type 2
Type:Protein
Mol. Mass.:50710.53
Organism:Homo sapiens (Human)
Description:O43614
Residue:444
BDBM50258773
NameBDBM50258773
Synonyms:2-(4-(5-methyl-2-(2H-1,2,3-triazol-2-yl)benzyl)-1,4-diazepan-1-yl)quinazoline | CHEMBL466259
TypeSmall organic molecule
Emp. Form.C23H25N7
Mol. Mass.399.4915
SMILESCc1ccc(c(CN2CCCN(CC2)c2ncc3ccccc3n2)c1)-n1nccn1