Reaction Details
TargetPituitary adenylate cyclase-activating polypeptide type I receptor
LigandBDBM50250068
Substrate/Competitorn/a
Meas. Tech.ChEMBL_498612 (CHEMBL966958)
EC50 20.6±n/a nM
Citation Bourgault, SVaudry, DSégalas-Milazzo, IGuilhaudis, LCouvineau, ALaburthe, MVaudry, HFournier, A Molecular and conformational determinants of pituitary adenylate cyclase-activating polypeptide (PACAP) for activation of the PAC1 receptor. J Med Chem52:3308-16 (2009) 
 
Pituitary adenylate cyclase-activating polypeptide type I receptor
Name:Pituitary adenylate cyclase-activating polypeptide type I receptor
Type:PROTEIN
Mol. Mass.:53307.50
Organism:Homo sapiens (Human)
Description:ChEMBL_498617
Residue:468
BDBM50250068
NameBDBM50250068
Synonyms:CHEMBL501240 PACAP-27 | [Glu3]PACAP27
TypeSmall organic molecule
Emp. Form.C143H226N40O39S
Mol. Mass.3161.634
SMILESCC[C@H](C)[C@H](NC(=O)CNC(=O)[C@H](CCC(O)=O)NC(=O)[C@H](CO)NC(=O)[C@@H](N)Cc1cnc[nH]1)C(=O)N[C@@H](Cc1ccccc1)C(=O)N[C@@H]([C@@H](C)O)C(=O)N[C@@H](CC(O)=O)C(=O)N[C@@H](CO)C(=O)N[C@@H](Cc1ccc(O)cc1)C(=O)N[C@@H](CO)C(=O)N[C@@H](CCCN=C(N)N)C(=O)N[C@@H](Cc1ccc(O)cc1)C(=O)N[C@@H](CCCN=C(N)N)C(=O)N[C@@H](CCCCN)C(=O)N[C@@H](CCC(N)=O)C(=O)N[C@@H](CCSC)C(=O)N[C@@H](C)C(=O)N[C@@H](C(C)C)C(=O)N[C@@H](CCCCN)C(=O)N[C@@H](CCCCN)C(=O)N[C@@H](Cc1ccc(O)cc1)C(=O)N[C@@H](CC(C)C)C(=O)N[C@@H](C)C(=O)N[C@@H](C)C(=O)N[C@@H](C(C)C)C(=O)N[C@@H](CC(C)C)C(N)=O