Reaction Details
TargetMitogen-activated protein kinase kinase kinase 8
LigandBDBM50258424
Substrate/Competitorn/a
Meas. Tech.ChEMBL_500017 (CHEMBL1022929)
Ki>4000±n/a nM
Citation Grey, RPierce, ACBemis, GWJacobs, MDMoody, CSJajoo, RMohal, NGreen, J Structure-based design of 3-aryl-6-amino-triazolo[4,3-b]pyridazine inhibitors of Pim-1 kinase. Bioorg Med Chem Lett19:3019-22 (2009) 
 
Mitogen-activated protein kinase kinase kinase 8
Name:Mitogen-activated protein kinase kinase kinase 8
Type:Serine/threonine-protein kinase
Mol. Mass.:52916.89
Organism:Homo sapiens (Human)
Description:P41279
Residue:467
BDBM50258424
NameBDBM50258424
Synonyms:CHEMBL494221 | trans-4-(3-(3-(trifluoromethyl)phenyl)-[1,2,4]triazolo[4,3-b]pyridazin-6-ylamino)cyclohexanol
TypeSmall organic molecule
Emp. Form.C18H18F3N5O
Mol. Mass.377.3636
SMILESO[C@H]1CC[C@@H](CC1)Nc1ccc2nnc(-c3cccc(c3)C(F)(F)F)n2n1