Reaction Details
TargetSerine/threonine-protein kinase pim-1
LigandBDBM50258857
Substrate/Competitorn/a
Meas. Tech.ChEMBL_500013 (CHEMBL1022925)
Ki 410±n/a nM
Citation Grey, RPierce, ACBemis, GWJacobs, MDMoody, CSJajoo, RMohal, NGreen, J Structure-based design of 3-aryl-6-amino-triazolo[4,3-b]pyridazine inhibitors of Pim-1 kinase. Bioorg Med Chem Lett19:3019-22 (2009) 
 
Serine/threonine-protein kinase pim-1
Name:Serine/threonine-protein kinase pim-1
Type:Protein
Mol. Mass.:35681.82
Organism:Homo sapiens (Human)
Description:P11309
Residue:313
BDBM50258857
NameBDBM50258857
Synonyms:CHEMBL512095 | N-cyclopropyl-3-(3-methoxyphenyl)-[1,2,4]triazolo[4,3-b]pyridazin-6-amine
TypeSmall organic molecule
Emp. Form.C15H15N5O
Mol. Mass.281.3125
SMILESCOc1cccc(c1)-c1nnc2ccc(NC3CC3)nn12