Reaction Details
TargetSerine/threonine-protein kinase pim-1
LigandBDBM50258812
Substrate/Competitorn/a
Meas. Tech.ChEMBL_500013 (CHEMBL1022925)
Ki 1800±n/a nM
Citation Grey, RPierce, ACBemis, GWJacobs, MDMoody, CSJajoo, RMohal, NGreen, J Structure-based design of 3-aryl-6-amino-triazolo[4,3-b]pyridazine inhibitors of Pim-1 kinase. Bioorg Med Chem Lett19:3019-22 (2009) 
 
Serine/threonine-protein kinase pim-1
Name:Serine/threonine-protein kinase pim-1
Type:Protein
Mol. Mass.:35681.82
Organism:Homo sapiens (Human)
Description:P11309
Residue:313
BDBM50258812
NameBDBM50258812
Synonyms:CHEMBL468297 | N-cyclopropyl-3-phenyl-[1,2,4]triazolo[4,3-b]pyridazin-6-amine
TypeSmall organic molecule
Emp. Form.C14H13N5
Mol. Mass.251.2865
SMILESC1CC1Nc1ccc2nnc(-c3ccccc3)n2n1