Reaction Details
TargetIntegrin alpha-4
LigandBDBM50128319
Substrate/Competitorn/a
Meas. Tech.ChEMBL_522802 (CHEMBL999755)
IC50 1.5±n/a nM
Citation Lin, LSLanza, TJewell, JPLiu, PJones, CKieczykowski, GRTreonze, KSi, QManior, SKoo, GTong, XWang, JSchuelke, APivnichny, JWang, RRaab, CVincent, SDavies, PMaccoss, MMumford, RAHagmann, WK Discovery of N-{N-[(3-cyanophenyl)sulfonyl]-4(R)-cyclobutylamino-(L)-prolyl}-4-[(3',5'-dichloroisonicotinoyl) amino]-(L)-phenylalanine (MK-0668), an extremely potent and orally active antagonist of very late antigen-4. J Med Chem52:3449-52 (2009) 
 
Integrin alpha-4
Name:Integrin alpha-4
Type:Membrane Protein
Mol. Mass.:114897.35
Organism:Homo sapiens (Human)
Description:P13612
Residue:1032
BDBM50128319
NameBDBM50128319
Synonyms:(S)-2-{[(S)-1-(3,5-Dichloro-benzenesulfonyl)-pyrrolidine-2-carbonyl]-amino}-3-{4-[(3,5-dichloro-pyridine-4-carbonyl)-amino]-phenyl}-propionic acid CHEMBL296804
TypeSmall organic molecule
Emp. Form.C26H22Cl4N4O6S
Mol. Mass.660.353
SMILESOC(=O)[C@H](Cc1ccc(NC(=O)c2c(Cl)cncc2Cl)cc1)NC(=O)[C@@H]1CCCN1S(=O)(=O)c1cc(Cl)cc(Cl)c1