Reaction Details
TargetIntegrin alpha-4
LigandBDBM50258535
Substrate/Competitorn/a
Meas. Tech.ChEMBL_522802 (CHEMBL999755)
IC50 0.300000±n/a nM
Citation Lin, LSLanza, TJewell, JPLiu, PJones, CKieczykowski, GRTreonze, KSi, QManior, SKoo, GTong, XWang, JSchuelke, APivnichny, JWang, RRaab, CVincent, SDavies, PMaccoss, MMumford, RAHagmann, WK Discovery of N-{N-[(3-cyanophenyl)sulfonyl]-4(R)-cyclobutylamino-(L)-prolyl}-4-[(3',5'-dichloroisonicotinoyl) amino]-(L)-phenylalanine (MK-0668), an extremely potent and orally active antagonist of very late antigen-4. J Med Chem52:3449-52 (2009) 
 
Integrin alpha-4
Name:Integrin alpha-4
Type:Membrane Protein
Mol. Mass.:114897.35
Organism:Homo sapiens (Human)
Description:P13612
Residue:1032
BDBM50258535
NameBDBM50258535
Synonyms:CHEMBL448863 | N-{N-[(3,5-Dichlorophenyl)sulfonyl]-4(R)-piperdinyl-(L)-prolyl}-4-[(3',5'-dichloroisonicotinoyl)amino]-(L)-phenylalanine
TypeSmall organic molecule
Emp. Form.C31H31Cl4N5O6S
Mol. Mass.743.485
SMILESOC(=O)[C@H](Cc1ccc(NC(=O)c2c(Cl)cncc2Cl)cc1)NC(=O)[C@@H]1C[C@H](CN1S(=O)(=O)c1cc(Cl)cc(Cl)c1)N1CCCCC1