Reaction Details
TargetCalcitonin gene-related peptide type 1 receptor
LigandBDBM50268476
Substrate/Competitorn/a
Meas. Tech.ChEMBL_523854 (CHEMBL1004155)
IC50 0.18±n/a nM
Citation Degnan, APConway, CMDalterio, RAMacci, RMercer, SESchartman, RXu, CDubowchik, GMMacor, JE Carbamates as potent calcitonin gene-related peptide antagonists with improved solution stability. Bioorg Med Chem Lett19:3555-8 (2009) 
 
Calcitonin gene-related peptide type 1 receptor
Name:Calcitonin gene-related peptide type 1 receptor
Type:Enzyme Catalytic Domain
Mol. Mass.:52980.45
Organism:Homo sapiens (Human)
Description:Q16602
Residue:461
BDBM50268476
NameBDBM50268476
Synonyms:(R)-1-(1,4'-bipiperidin-1'-yl)-3-(7-methyl-1H-indazol-5-yl)-1-oxopropan-2-yl 4-(isoquinolin-3-yl)piperidine-1-carboxylate | CHEMBL499810
TypeSmall organic molecule
Emp. Form.C36H44N6O3
Mol. Mass.608.773
SMILESCc1cc(C[C@@H](OC(=O)N2CCC(CC2)c2cc3ccccc3cn2)C(=O)N2CCC(CC2)N2CCCCC2)cc2cn[nH]c12