Reaction Details
TargetBifunctional epoxide hydrolase 2
LigandBDBM50268441
Substrate/Competitorn/a
Meas. Tech.ChEMBL_523917 (CHEMBL1001510)
IC50 3±n/a nM
Citation Shen, HCDing, FXWang, SXu, SChen, HSTong, XTong, VMitra, KKumar, SZhang, XChen, YZhou, GPai, LYAlonso-Galicia, MChen, XZhang, BTata, JRBerger, JPColletti, SL Discovery of spirocyclic secondary amine-derived tertiary ureas as highly potent, selective and bioavailable soluble epoxide hydrolase inhibitors. Bioorg Med Chem Lett19:3398-404 (2009) 
 
Bifunctional epoxide hydrolase 2
Name:Bifunctional epoxide hydrolase 2
Type:Enzyme
Mol. Mass.:62613.07
Organism:Homo sapiens (Human)
Description:P34913
Residue:555
BDBM50268441
NameBDBM50268441
Synonyms:1-(6-fluorospiro[chroman-2,4'-piperidine]-1'-yl)-3-phenylpropan-1-one | CHEMBL447085
TypeSmall organic molecule
Emp. Form.C22H24FNO2
Mol. Mass.353.4299
SMILESFc1ccc2OC3(CCN(CC3)C(=O)CCc3ccccc3)CCc2c1