Reaction Details
TargetBifunctional epoxide hydrolase 2
LigandBDBM50268439
Substrate/Competitorn/a
Meas. Tech.ChEMBL_523917 (CHEMBL1001510)
IC50<1±n/a nM
Citation Shen, HCDing, FXWang, SXu, SChen, HSTong, XTong, VMitra, KKumar, SZhang, XChen, YZhou, GPai, LYAlonso-Galicia, MChen, XZhang, BTata, JRBerger, JPColletti, SL Discovery of spirocyclic secondary amine-derived tertiary ureas as highly potent, selective and bioavailable soluble epoxide hydrolase inhibitors. Bioorg Med Chem Lett19:3398-404 (2009) 
 
Bifunctional epoxide hydrolase 2
Name:Bifunctional epoxide hydrolase 2
Type:Enzyme
Mol. Mass.:62613.07
Organism:Homo sapiens (Human)
Description:P34913
Residue:555
BDBM50268439
NameBDBM50268439
Synonyms:(6-(methylsulfonyl)spiro[chroman-2,4'-piperidine]-1'-yl)(4-(trifluoromethyl)phenyl)methanone | CHEMBL497828
TypeSmall organic molecule
Emp. Form.C22H22F3NO4S
Mol. Mass.453.475
SMILESCS(=O)(=O)c1ccc2OC3(CCN(CC3)C(=O)c3ccc(cc3)C(F)(F)F)CCc2c1