Reaction Details
TargetBifunctional epoxide hydrolase 2
LigandBDBM50268438
Substrate/Competitorn/a
Meas. Tech.ChEMBL_523915 (CHEMBL1001508)
IC50 4±n/a nM
Citation Shen, HCDing, FXWang, SXu, SChen, HSTong, XTong, VMitra, KKumar, SZhang, XChen, YZhou, GPai, LYAlonso-Galicia, MChen, XZhang, BTata, JRBerger, JPColletti, SL Discovery of spirocyclic secondary amine-derived tertiary ureas as highly potent, selective and bioavailable soluble epoxide hydrolase inhibitors. Bioorg Med Chem Lett19:3398-404 (2009) 
 
Bifunctional epoxide hydrolase 2
Name:Bifunctional epoxide hydrolase 2
Type:Enzyme
Mol. Mass.:62613.07
Organism:Homo sapiens (Human)
Description:P34913
Residue:555
BDBM50268438
NameBDBM50268438
Synonyms:CHEMBL524992 | spiro[chroman-2,4'-piperidine]-1'-yl(4-(trifluoromethyl)phenyl)methanone
TypeSmall organic molecule
Emp. Form.C21H20F3NO2
Mol. Mass.375.3842
SMILESFC(F)(F)c1ccc(cc1)C(=O)N1CCC2(CC1)CCc1ccccc1O2