Reaction Details
TargetBifunctional epoxide hydrolase 2
LigandBDBM50268434
Substrate/Competitorn/a
Meas. Tech.ChEMBL_523915 (CHEMBL1001508)
IC50 4±n/a nM
Citation Shen, HCDing, FXWang, SXu, SChen, HSTong, XTong, VMitra, KKumar, SZhang, XChen, YZhou, GPai, LYAlonso-Galicia, MChen, XZhang, BTata, JRBerger, JPColletti, SL Discovery of spirocyclic secondary amine-derived tertiary ureas as highly potent, selective and bioavailable soluble epoxide hydrolase inhibitors. Bioorg Med Chem Lett19:3398-404 (2009) 
 
Bifunctional epoxide hydrolase 2
Name:Bifunctional epoxide hydrolase 2
Type:Enzyme
Mol. Mass.:62613.07
Organism:Homo sapiens (Human)
Description:P34913
Residue:555
BDBM50268434
NameBDBM50268434
Synonyms:(+/-)-6-(1-methyl-1H-pyrazol-5-yl)-4-oxo-N-((tans)-2-phenylcyclopropyl)spiro[chroman-2,4'-piperidine]-1'-carboxamide | CHEMBL495792
TypeSmall organic molecule
Emp. Form.C27H28N4O3
Mol. Mass.456.5362
SMILESCn1nccc1-c1ccc2OC3(CCN(CC3)C(=O)N[C@H]3C[C@@H]3c3ccccc3)CC(=O)c2c1