Reaction Details
TargetMuscarinic acetylcholine receptor M2
LigandBDBM50008072
Substrate/Competitorn/a
Meas. Tech.ChEBML_140103
IC50 8800±n/a nM
Citation Hobbs, SHJohnson, SJKesten, SRPavia, MRDavis, RESchwarz, RDCoughenour, LLMyers, SLDudley, DTMoss, WH Cholinergic agents: 2-oxazolidinone analogues of the acetylcholine-receptor muscarinic agonist pilocarpine Bioorg Med Chem Lett1:147-150 (1991)    Article
 
Muscarinic acetylcholine receptor M2
Name:Muscarinic acetylcholine receptor M2
Type:Enzyme Catalytic Domain
Mol. Mass.:51555.53
Organism:RAT
Description:P10980
Residue:466
BDBM50008072
NameBDBM50008072
Synonyms:(+)-pilocarpine (3S,4R)-3-ethyldihydro-4-((1-methyl-1H-imidazol-5-yl)methyl)-2(3H)-furanone CHEMBL550 PILOCARPINE | PILOCARPINE HYDROCHLORIDE
TypeSmall organic molecule
Emp. Form.C11H16N2O2
Mol. Mass.208.2569
SMILESCC[C@H]1[C@@H](Cc2cncn2C)COC1=O