Reaction Details
TargetMuscarinic acetylcholine receptor M1
LigandBDBM50004656
Substrate/Competitorn/a
Meas. Tech.ChEBML_139951
IC50 44370±n/a nM
Citation Hobbs, SHJohnson, SJKesten, SRPavia, MRDavis, RESchwarz, RDCoughenour, LLMyers, SLDudley, DTMoss, WH Cholinergic agents: 2-oxazolidinone analogues of the acetylcholine-receptor muscarinic agonist pilocarpine Bioorg Med Chem Lett1:147-150 (1991)    Article
 
Muscarinic acetylcholine receptor M1
Name:Muscarinic acetylcholine receptor M1
Type:Enzyme Catalytic Domain
Mol. Mass.:51390.46
Organism:RAT
Description:P08482
Residue:460
BDBM50004656
NameBDBM50004656
Synonyms:(2-Carbamoyloxy-ethyl)-trimethyl-ammonium (2-Hydroxyethyl)trimethyl ammonium chloride carbamate (carbachol)(2-Carbamoyloxy-ethyl)-trimethyl-ammonium 2-((Aminocarbonyl)oxy)-N,N,N-trimethylethanaminum chloride 2-(carbamoyloxy)-N,N,N-trimethylethanaminium chloride CARBASTAT Carbachol chloride Choline carbamate chloride Choline chlorine carbamate Karbamoylcholin chlorid | MIOSTAT
TypeSmall organic molecule
Emp. Form.C6H15N2O2
Mol. Mass.147.195
SMILESC[N+](C)(C)CCOC(N)=O