Reaction Details
TargetEpidermal growth factor receptor
LigandBDBM50279860
Substrate/Competitorn/a
Meas. Tech.ChEBML_67067
IC50 7000±n/a nM
Citation BurkeJr., TRLi, ZHBolen, JBMarquez, VE Structural influences of styryl-based inhibitors on epidermal growth factor receptor and p56lck tyrosine-specific protein kinases. Bioorg Med Chem Lett1:165-168 (1991)    Article
 
Epidermal growth factor receptor
Name:Epidermal growth factor receptor
Type:Receptor Kinase Domain
Mol. Mass.:134279.59
Organism:Homo sapiens (Human)
Description:P00533
Residue:1210
BDBM50279860
NameBDBM50279860
Synonyms:CHEMBL46946 N-[(E)-2-(3,4-Dihydroxy-phenyl)-vinyl]-formamide
TypeSmall organic molecule
Emp. Form.C9H9NO3
Mol. Mass.179.1727
SMILESOc1ccc(\C=C\NC=O)cc1O