Reaction Details
TargetEpidermal growth factor receptor
LigandBDBM50279861
Substrate/Competitorn/a
Meas. Tech.ChEBML_67067
IC50 10000±n/a nM
Citation BurkeJr., TRLi, ZHBolen, JBMarquez, VE Structural influences of styryl-based inhibitors on epidermal growth factor receptor and p56lck tyrosine-specific protein kinases. Bioorg Med Chem Lett1:165-168 (1991)    Article
 
Epidermal growth factor receptor
Name:Epidermal growth factor receptor
Type:Receptor Kinase Domain
Mol. Mass.:134279.59
Organism:Homo sapiens (Human)
Description:P00533
Residue:1210
BDBM50279861
NameBDBM50279861
Synonyms:(E)-2-Cyano-3-(2,5-dihydroxy-phenyl)-acrylamide | CHEMBL47660
TypeSmall organic molecule
Emp. Form.C10H8N2O3
Mol. Mass.204.1821
SMILESNC(=O)C(=C\c1cc(O)ccc1O)\C#N