Reaction Details
TargetCarboxypeptidase A1
LigandBDBM50279960
Substrate/Competitorn/a
Meas. Tech.ChEBML_45615
Ki 105±n/a nM
Citation Kim, DHKim, KB The function of S1′ subsite pocket of carboxypeptidase A Bioorg Med Chem Lett1:323-326 (1991)    Article
 
Carboxypeptidase A1
Name:Carboxypeptidase A1
Type:Enzyme
Mol. Mass.:47073.90
Organism:Bos taurus (bovine)
Description:From Sigma-Aldrich Co.
Residue:419
BDBM50279960
NameBDBM50279960
Synonyms:2-Mercaptomethyl-3-phenyl-butyric acid | CHEMBL109771
TypeSmall organic molecule
Emp. Form.C11H14O2S
Mol. Mass.210.293
SMILESCC(C(CS)C(O)=O)c1ccccc1