Reaction Details
TargetReverse transcriptase/RNaseH
LigandBDBM50280305
Substrate/Competitorn/a
Meas. Tech.ChEBML_197421
IC50 72800±n/a nM
Citation Terrett, NTBojanic, DMerson, JRStephenson, PT Imidazo[2′-3′-:6,5]dipyrido[3,2-b:2′,3′-e]-1,4-diazepines: non-nucleoside HIV-1 reverse transcriptase inhibitors with greater enzyme affinity than nevirapine Bioorg Med Chem Lett2:1745-1750 (1992)    Article
 
Reverse transcriptase/RNaseH
Name:Reverse transcriptase/RNaseH
Type:PROTEIN
Mol. Mass.:65229.15
Organism:Human immunodeficiency virus 1
Description:ChEMBL_1473730
Residue:566
BDBM50280305
NameBDBM50280305
Synonyms:8-Ethyl-8H-1,2,3a,7,8,9-hexaaza-dibenzo[e,h]azulene | CHEMBL295165
TypeSmall organic molecule
Emp. Form.C14H12N6
Mol. Mass.264.2853
SMILESCCN1c2ncccc2-c2nncn2-c2cccnc12