Reaction Details
TargetReverse transcriptase/RNaseH
LigandBDBM50050637
Substrate/Competitorn/a
Meas. Tech.ChEBML_197421
IC50 3900±n/a nM
Citation Terrett, NTBojanic, DMerson, JRStephenson, PT Imidazo[2′-3′-:6,5]dipyrido[3,2-b:2′,3′-e]-1,4-diazepines: non-nucleoside HIV-1 reverse transcriptase inhibitors with greater enzyme affinity than nevirapine Bioorg Med Chem Lett2:1745-1750 (1992)    Article
 
Reverse transcriptase/RNaseH
Name:Reverse transcriptase/RNaseH
Type:PROTEIN
Mol. Mass.:65229.15
Organism:Human immunodeficiency virus 1
Description:ChEMBL_1473730
Residue:566
BDBM50050637
NameBDBM50050637
Synonyms:(8-Ethyl-8H-1,3a,7,8,9-pentaaza-dibenzo[e,h]azulen-6-yl)-dimethyl-amine | CHEMBL43324
TypeSmall organic molecule
Emp. Form.C17H18N6
Mol. Mass.306.365
SMILESCCN1c2ncccc2-c2nccn2-c2ccc(nc12)N(C)C