Reaction Details
TargetDelta-type opioid receptor
LigandBDBM50019056
Substrate/Competitorn/a
Meas. Tech.ChEMBL_217855 (CHEMBL822178)
IC50 1±n/a nM
Citation Ojima, IKato, KJameison, FAConway, JNakahashi, KHagiwara, MMiyamae, TRadunz, HE New potent enkephalin analogs containing trifluoromethylamino acid residues Bioorg Med Chem Lett2:219-222 (1992)    Article
 
Delta-type opioid receptor
Name:Delta-type opioid receptor
Type:G Protein-Coupled Receptor (GPCR)
Mol. Mass.:40465.04
Organism:Rattus norvegicus (rat)
Description:Competition binding assays were using CHO-K1 cell membranes expressing the opioid receptor.
Residue:372
BDBM50019056
NameBDBM50019056
Synonyms:(S)-2-[(S)-2-(2-{2-[(S)-2-Amino-3-(4-hydroxy-phenyl)-propionylamino]-acetylamino}-acetylamino)-3-phenyl-propionylamino]-4-methylsulfanyl-butyric acid 2-[(S)-2-(2-{2-[(S)-2-Amino-3-(4-hydroxy-phenyl)-propionylamino]-acetylamino}-acetylamino)-1-oxo-3-phenyl-propylamino]-4-methylsulfanyl-butyric acid 2-[2-(2-{2-[2-Amino-3-(4-hydroxy-phenyl)-propionylamino]-acetylamino}-acetylamino)-3-phenyl-propionylamino]-4-methylsulfanyl-butyric acid H-Tyr-Gly-Gly-Phe-Met-OH [Met5]-enkephalin | met-enkephalin
TypeSmall organic molecule
Emp. Form.C27H35N5O7S
Mol. Mass.573.661
SMILESCSCC[C@H](NC(=O)[C@H](Cc1ccccc1)NC(=O)CNC(=O)CNC(=O)[C@@H](N)Cc1ccc(O)cc1)C(O)=O