Reaction Details
TargetSterol O-acyltransferase 1
LigandBDBM50051901
Substrate/Competitorn/a
Meas. Tech.ChEMBL_48914 (CHEMBL660744)
IC50 25±n/a nM
Citation Ashton, MJBridge, AWBush, RCDron, DIHarris, NVJones, GDLythgoe, DJRiddell, DSmith, C RP 70676: A potent systematically available inhibitor of acyl-CoA:cholesterol O-acyl transferase (ACAT) Bioorg Med Chem Lett2:375-380 (1992)    Article
 
Sterol O-acyltransferase 1
Name:Sterol O-acyltransferase 1
Type:PROTEIN
Mol. Mass.:64165.56
Organism:Rattus norvegicus
Description:ChEMBL_28796
Residue:545
BDBM50051901
NameBDBM50051901
Synonyms:1-[5-(4,5-Diphenyl-1H-imidazol-2-ylsulfanyl)-pentyl]-3,5-dimethyl-1H-pyrazole | CHEMBL33780
TypeSmall organic molecule
Emp. Form.C25H28N4S
Mol. Mass.416.582
SMILESCc1cc(C)n(CCCCCSc2nc(c([nH]2)-c2ccccc2)-c2ccccc2)n1