Reaction Details
TargetSterol O-acyltransferase 1
LigandBDBM50033969
Substrate/Competitorn/a
Meas. Tech.ChEMBL_48914 (CHEMBL660744)
IC50 10±n/a nM
Citation Ashton, MJBridge, AWBush, RCDron, DIHarris, NVJones, GDLythgoe, DJRiddell, DSmith, C RP 70676: A potent systematically available inhibitor of acyl-CoA:cholesterol O-acyl transferase (ACAT) Bioorg Med Chem Lett2:375-380 (1992)    Article
 
Sterol O-acyltransferase 1
Name:Sterol O-acyltransferase 1
Type:PROTEIN
Mol. Mass.:64165.56
Organism:Rattus norvegicus
Description:ChEMBL_28796
Residue:545
BDBM50033969
NameBDBM50033969
Synonyms:3-(2,4-Difluoro-phenyl)-1-[5-(4,5-diphenyl-1H-imidazol-2-ylsulfanyl)-pentyl]-1-heptyl-urea Lecimibide
TypeSmall organic molecule
Emp. Form.C34H40F2N4OS
Mol. Mass.590.769
SMILESCCCCCCCN(CCCCCSc1nc(c([nH]1)-c1ccccc1)-c1ccccc1)C(=O)Nc1ccc(F)cc1F