Reaction Details
TargetSterol O-acyltransferase 1
LigandBDBM50051901
Substrate/Competitorn/a
Meas. Tech.ChEMBL_48780 (CHEMBL661632)
IC50 43±n/a nM
Citation Ashton, MJBridge, AWBush, RCDron, DIHarris, NVJones, GDLythgoe, DJRiddell, DSmith, C RP 70676: A potent systematically available inhibitor of acyl-CoA:cholesterol O-acyl transferase (ACAT) Bioorg Med Chem Lett2:375-380 (1992)    Article
 
Sterol O-acyltransferase 1
Name:Sterol O-acyltransferase 1
Type:Multi-pass membrane protein may form homo- or heterodimers.
Mol. Mass.:64751.94
Organism:Homo sapiens (Human)
Description:P35610
Residue:550
BDBM50051901
NameBDBM50051901
Synonyms:1-[5-(4,5-Diphenyl-1H-imidazol-2-ylsulfanyl)-pentyl]-3,5-dimethyl-1H-pyrazole | CHEMBL33780
TypeSmall organic molecule
Emp. Form.C25H28N4S
Mol. Mass.416.582
SMILESCc1cc(C)n(CCCCCSc2nc(c([nH]2)-c2ccccc2)-c2ccccc2)n1