Reaction Details
TargetD(1A) dopamine receptor
LigandBDBM50280441
Substrate/Competitorn/a
Meas. Tech.ChEBML_58794
Ki 5.1±n/a nM
Citation Chang, WKPeters, MFevig, VPKozlowski, JAZhou, GLowe, DBGuzik, HMcQuade, RDDuffy, RCoffin, VLBerger, JG Dopamine receptor binding properties of some 2,3,4,5-tetrahydro-1H-3-benzazepine-7-ols with non-aromatic substituents in the 5-position Bioorg Med Chem Lett2:399-402 (1992)    Article
 
D(1A) dopamine receptor
Name:D(1A) dopamine receptor
Type:Enzyme Catalytic Domain
Mol. Mass.:49429.75
Organism:RAT
Description:P18901
Residue:446
BDBM50280441
NameBDBM50280441
Synonyms:8-Chloro-5-cyclopent-1-enyl-3-methyl-2,3,4,5-tetrahydro-1H-benzo[d]azepin-7-ol | CHEMBL340855
TypeSmall organic molecule
Emp. Form.C16H20ClNO
Mol. Mass.277.789
SMILESCN1CCc2cc(Cl)c(O)cc2C(C1)C1=CCCC1