Reaction Details
TargetMuscarinic acetylcholine receptor M1
LigandBDBM50003359
Substrate/Competitorn/a
Meas. Tech.ChEBML_139952
IC50 7±n/a nM
Citation Sauerberg, POlesen, PHSuzdak, PDSheardown, MJMitch, CHSawyer, BDShannon, HE Synthesis and structure-activity relationships of heterocyclic analogues of the functional M1 selective muscarinic agonist hexyloxy-TZTP Bioorg Med Chem Lett2:809-814 (1992)    Article
 
Muscarinic acetylcholine receptor M1
Name:Muscarinic acetylcholine receptor M1
Type:Enzyme Catalytic Domain
Mol. Mass.:51390.46
Organism:RAT
Description:P08482
Residue:460
BDBM50003359
NameBDBM50003359
Synonyms:5-(4-Hexyloxy-[1,2,5]thiadiazol-3-yl)-1-methyl-1,2,3,6-tetrahydro-pyridine; oxalic acid CHEMBL21536 LY 246708 | Xanomeline
TypeSmall organic molecule
Emp. Form.C14H23N3OS
Mol. Mass.281.417
SMILESCCCCCCOc1nsnc1C1=CCCN(C)C1