Reaction Details
TargetAcetylcholinesterase
LigandBDBM50029941
Substrate/Competitorn/a
Meas. Tech.ChEBML_28922
IC50 30±n/a nM
Citation Sugimoto, HIimura, YYamanishi, YYamatsu, K Synthesis and anti-acetylcholinesterase activity of 1-benzyl-4-[(5,6-dimethoxy-1-indanon-2-yl)methyl]piperidine hydrochloride (E2020) and related compounds Bioorg Med Chem Lett2:871-876 (1992)    Article
 
Acetylcholinesterase
Name:Acetylcholinesterase
Type:Enzyme
Mol. Mass.:68165.65
Organism:Mus musculus (mouse)
Description:n/a
Residue:614
BDBM50029941
NameBDBM50029941
Synonyms:2-[2-(1-Benzyl-piperidin-4-yl)-ethyl]-5,6-dimethoxy-indan-1-one; hydrochloride CHEMBL545317
TypeSmall organic molecule
Emp. Form.C25H31NO3
Mol. Mass.393.5185
SMILESCOc1cc2CC(CCC3CCN(Cc4ccccc4)CC3)C(=O)c2cc1OC