Reaction Details
TargetAlpha-1A/Alpha-1B/Alpha-1D adrenergic receptor
LigandBDBM50079387
Substrate/Competitorn/a
Meas. Tech.ChEMBL_34135 (CHEMBL644129)
IC50 800±n/a nM
Citation Chenard, BLButler, TWShalaby, IAProchniak, MAKoe, BKFox, CB Oxindole N-Methyl-D-Aspartate (NMDA) antagonists Bioorg Med Chem Lett3:91-94 (1993)    Article
 
Alpha-1A/Alpha-1B/Alpha-1D adrenergic receptor
Name:Alpha-1A/Alpha-1B/Alpha-1D adrenergic receptor
Type:n/a
Mol. Mass.:n/a
Description:ASSAY_ID of EBI is 303470
Components:This complex has 3 components.
Component 1
Name:Alpha-1B adrenergic receptor
Synonyms:ADA1B_RAT Alpha 1B-adrenoceptor Alpha adrenergic receptor 1A and 1B Alpha-1Adrenoceptor Alpha-1B adrenoreceptor | adrenergic Alpha1B
Type:G Protein-Coupled Receptor (GPCR)
Mol. Mass.:56606.71
Organism:Rattus norvegicus (rat)
Description:Receptor binding assays were performed using rat cortical membranes.
Residue:515
Component 2
Name:Alpha-1A adrenergic receptor
Synonyms:ADA1A_RAT Adra1c Alpha-1A adrenoceptor Alpha-1C adrenergic receptor | adrenergic Alpha1A
Type:Protein
Mol. Mass.:51620.15
Organism:Rattus norvegicus (Rat)
Description:P43140
Residue:466
Component 3
Name:Alpha-1D adrenergic receptor
Synonyms:ADA1D_RAT Adra1d Alpha-1D adrenergic receptor | Serotonin 1a (5-HT1a) receptor/Adrenergic receptor alpha-1
Type:Protein
Mol. Mass.:59375.97
Organism:Rattus norvegicus (Rat)
Description:P23944
Residue:561
BDBM50079387
NameBDBM50079387
Synonyms:1-(4-Chloro-phenyl)-2-[4-(4-fluoro-benzyl)-piperidin-1-yl]-ethanol Eliprodil
TypeSmall organic molecule
Emp. Form.C20H23ClFNO
Mol. Mass.347.854
SMILESOC(CN1CCC(Cc2ccc(F)cc2)CC1)c1ccc(Cl)cc1