Reaction Details
Target5-hydroxytryptamine receptor 1A/1B/1D/1F
LigandBDBM50280817
Substrate/Competitorn/a
Meas. Tech.ChEMBL_193825 (CHEMBL803380)
IC50 2.1±n/a nM
Citation Mignani, SDamour, DDoble, ALabaudinière, RMalleron, JLPiot, OGueremy, C New indole derivatives as potent and selective serotonin uptake inhibitors Bioorg Med Chem Lett3:1913-1918 (1993)    Article
 
5-hydroxytryptamine receptor 1A/1B/1D/1F
Name:5-hydroxytryptamine receptor 1A/1B/1D/1F
Synonyms:Serotonin 1 (5-HT1) receptor
Type:n/a
Mol. Mass.:n/a
Description:ASSAY_ID of ChEMBL is 193825
Components:This complex has 4 components.
Component 1
Name:5-hydroxytryptamine receptor 1D
Type:Enzyme Catalytic Domain
Mol. Mass.:41551.75
Organism:RAT
Description:5-HT1D HTR1D RAT::P28565
Residue:374
Component 2
Name:5-hydroxytryptamine receptor 1A
Synonyms:5-HT-1A 5-HT1A 5-hydroxytryptamine receptor 1A (5HT1A) 5ht1a Htr1a Serotonin 1a (5-HT1a) receptor/Adrenergic receptor alpha-1 | Serotonin receptor 1A
Type:G Protein-Coupled Receptor (GPCR)
Mol. Mass.:46445.29
Organism:Rattus norvegicus (rat)
Description:Binding assays were performed using rat hippocampal membranes.
Residue:422
Component 3
Name:5-hydroxytryptamine receptor 1B
Synonyms:5-HT-1B 5-hydroxytryptamine receptor 1B (5HT1B) 5ht1b Serotonin 1 (5-HT1) receptor Serotonin receptor 1B
Type:Protein
Mol. Mass.:43173.33
Organism:Rattus norvegicus (Rat)
Description:P28564
Residue:386
Component 4
Name:5-hydroxytryptamine receptor 1F
Synonyms:5-HT-1F 5-hydroxytryptamine receptor 1F 5ht1f Serotonin 1 (5-HT1) receptor Serotonin receptor 1F
Type:Enzyme Catalytic Domain
Mol. Mass.:41896.93
Organism:RAT
Description:5-HT1F HTR1F RAT::P30940
Residue:366
BDBM50280817
NameBDBM50280817
Synonyms:2-{2-[4-(5-Fluoro-1H-indol-3-ylmethyl)-piperidin-1-yl]-ethyl}-1,1-dioxo-1,4-dihydro-2H-1lambda*6*-benzo[1,2,4]thiadiazin-3-one | CHEMBL299917
TypeSmall organic molecule
Emp. Form.C23H25FN4O3S
Mol. Mass.456.533
SMILESFc1ccc2[nH]cc(CC3CCN(CCN4C(=O)Nc5ccccc5S4(=O)=O)CC3)c2c1