Reaction Details
TargetCaspase-1
LigandBDBM12197
Substrate/Competitorn/a
Meas. Tech.ChEBML_90983
Ki 19±n/a nM
Citation Mjalli, AMChapman, KTMacCoss, MThornberry, NA Phenylalkyl ketones as potent reversible inhibitors of interleukin-1β converting enzyme Bioorg Med Chem Lett3:2689-2692 (1993)    Article
 
Caspase-1
Name:Caspase-1
Type:Enzyme
Mol. Mass.:45154.13
Organism:Homo sapiens (Human)
Description:P29466
Residue:404
BDBM12197
NameBDBM12197
Synonyms:(3S)-3-[(2S)-2-[(2S)-2-[(2S)-2-acetamido-3-(4-hydroxyphenyl)propanamido]-3-methylbutanamido]propanamido]-4-oxo-9-phenylnonanoic acid | tetrapeptide inhibitor 1
TypeSmall Organic Molecule
Emp. Form.C34H46N4O8
Mol. Mass.638.751
SMILESCC(C)[C@H](NC(=O)[C@H](Cc1ccc(O)cc1)NC(C)=O)C(=O)N[C@@H](C)C(=O)N[C@@H](CC(O)=O)C(=O)CCCCCc1ccccc1