Reaction Details
TargetCathepsin G
LigandBDBM50068898
Substrate/Competitorn/a
Meas. Tech.ChEBML_45365
Ki 1700±n/a nM
Citation Angelastro, MRBey, PMehdi, SJanusz, MJPeet, NP Janus compounds: dual inhibitors of proteinases Bioorg Med Chem Lett3:525-530 (1993)    Article
 
Cathepsin G
Name:Cathepsin G
Type:PROTEIN
Mol. Mass.:28860.08
Organism:Homo sapiens (Human)
Description:ChEMBL_1469016
Residue:255
BDBM50068898
NameBDBM50068898
Synonyms:BDBM50281588 {1-[2-(1-Benzyl-3,3,3-trifluoro-2-oxo-propylcarbamoyl)-pyrrolidine-1-carbonyl]-2-methyl-propyl}-carbamic acid tert-butyl ester
TypeSmall organic molecule
Emp. Form.C25H34F3N3O5
Mol. Mass.513.5498
SMILESCC(C)[C@H](NC(=O)OC(C)(C)C)C(=O)N1CCC[C@H]1C(=O)NC(Cc1ccccc1)C(=O)C(F)(F)F