Reaction Details
TargetNeutrophil elastase
LigandBDBM50281591
Substrate/Competitorn/a
Meas. Tech.ChEBML_144795
Ki 55±n/a nM
Citation Angelastro, MRBey, PMehdi, SJanusz, MJPeet, NP Janus compounds: dual inhibitors of proteinases Bioorg Med Chem Lett3:525-530 (1993)    Article
 
Neutrophil elastase
Name:Neutrophil elastase
Type:Enzyme
Mol. Mass.:28532.38
Organism:Homo sapiens (Human)
Description:P08246
Residue:267
BDBM50281591
NameBDBM50281591
Synonyms:CHEMBL345477 | {(S)-2-Methyl-1-[(S)-2-(3,3,4,4,4-pentafluoro-1-isopropyl-2-oxo-butylcarbamoyl)-pyrrolidine-1-carbonyl]-propyl}-carbamic acid tert-butyl ester
TypeSmall organic molecule
Emp. Form.C22H34F5N3O5
Mol. Mass.515.5145
SMILESCC(C)[C@H](NC(=O)OC(C)(C)C)C(=O)N1CCC[C@H]1C(=O)NC(C(C)C)C(=O)C(F)(F)C(F)(F)F