Reaction Details
TargetAngiotensin-converting enzyme
LigandBDBM50281632
Substrate/Competitorn/a
Meas. Tech.ChEBML_36007
Ki 1.7±n/a nM
Citation Horwell, DCHowson, WRatcliffe, GSRees, DC The design of a dipeptide library for screening at peptide receptor sites Bioorg Med Chem Lett3:799-802 (1993)    Article
 
Angiotensin-converting enzyme
Name:Angiotensin-converting enzyme
Type:Enzyme
Mol. Mass.:149709.01
Organism:Homo sapiens (Human)
Description:n/a
Residue:1306
BDBM50281632
NameBDBM50281632
Synonyms:(2S)-1-{(2S)-2-[(lambda~4~-sulfanylmethyl)amino]propanoyl}pyrrolidine-2-carboxylic acid | CHEMBL166164
TypeSmall organic molecule
Emp. Form.C9H16N2O3S
Mol. Mass.232.3
SMILESC[C@H](NCS)C(=O)N1CCC[C@H]1C(O)=O