Reaction Details
TargetRenin
LigandBDBM50006844
Substrate/Competitorn/a
Meas. Tech.ChEBML_196307
IC50 0.320000±n/a nM
Citation Hamilton, HSteinbaugh, BBlankley, JTaylor, MChan, OHStewart, BSchroeder, RRyan, MRapundalo, SCook, JBernabei, AStewart, C Evaluation of the intestinal permeability and hepatic handling of peptidomimetic analogs Bioorg Med Chem Lett3:813-818 (1993)    Article
 
Renin
Name:Renin
Type:PROTEIN
Mol. Mass.:44272.67
Organism:Rattus norvegicus
Description:ChEMBL_222765
Residue:402
BDBM50006844
NameBDBM50006844
Synonyms:(S)-N-[(S)-2-(2-Amino-thiazol-4-yl)-1-((1S,2R,3S)-1-cyclohexylmethyl-2,3-dihydroxy-5-methyl-hexylcarbamoyl)-ethyl]-2-(morpholine-4-sulfonylamino)-3-phenyl-propionamide CHEMBL34894 N-[2-(2-Amino-thiazol-4-yl)-1-(1-cyclohexylmethyl-2,3-dihydroxy-5-methyl-hexylcarbamoyl)-ethyl]-2-(morpholine-4-sulfonylamino)-3-phenyl-propionamide
TypeSmall organic molecule
Emp. Form.C33H52N6O7S2
Mol. Mass.708.932
SMILESCC(C)C[C@H](O)[C@H](O)[C@H](CC1CCCCC1)NC(=O)[C@H](Cc1csc(N)n1)NC(=O)[C@H](Cc1ccccc1)NS(=O)(=O)N1CCOCC1