Reaction Details
TargetCholecystokinin receptor type A
LigandBDBM50281666
Substrate/Competitorn/a
Meas. Tech.ChEBML_49722
Ki 1000±n/a nM
Citation Roques, BPCorringer, PJDerrien, MDaugé, VDurieux, C Structure-based design and pharmacological properties of potent selective and systemically active CCK-B peptidomimetics Bioorg Med Chem Lett3:847-850 (1993)    Article
 
Cholecystokinin receptor type A
Name:Cholecystokinin receptor type A
Type:n/a
Mol. Mass.:48229.77
Organism:Cavia porcellus
Description:n/a
Residue:430
BDBM50281666
NameBDBM50281666
Synonyms:Boc-Trp-Phg-Asp-1Nal-N(CH3)2 | CHEMBL436722
TypeSmall organic molecule
Emp. Form.C43H48N6O8
Mol. Mass.776.8766
SMILESCN(C)C(=O)[C@H](Cc1cccc2ccccc12)NC(=O)[C@H](CC(O)=O)NC(=O)[C@@H](NC(=O)[C@H](Cc1c[nH]c2ccccc12)NC(=O)OC(C)(C)C)c1ccccc1