Reaction Details
TargetThymidine kinase, cytosolic
LigandBDBM50282067
Substrate/Competitorn/a
Meas. Tech.ChEMBL_208022 (CHEMBL882138)
Ki 2900±n/a nM
Citation Kim, CUMisco, PFLuh, BYTerry, BBisacchi, GMansuri, MM (2R, 4S, 5S)-1-(tetrahydro-4-hydroxy-5-methoxy-2-furanyl)thymine: a potent selective inhibitor of herpes simplex thymidine kinase Bioorg Med Chem Lett3:1571-1576 (1993)    Article
 
Thymidine kinase, cytosolic
Name:Thymidine kinase, cytosolic
Type:PROTEIN
Mol. Mass.:25476.50
Organism:Homo sapiens (Human)
Description:ChEMBL_1333884
Residue:234
BDBM50282067
NameBDBM50282067
Synonyms:1-((2R,4S,5S)-4-Hydroxy-5-methoxy-tetrahydro-furan-2-yl)-5-methyl-1H-pyrimidine-2,4-dione | CHEMBL289441
TypeSmall organic molecule
Emp. Form.C10H14N2O5
Mol. Mass.242.2286
SMILESCO[C@H]1O[C@H](C[C@@H]1O)n1cc(C)c(=O)[nH]c1=O