Reaction Details
TargetThymidine kinase, cytosolic
LigandBDBM50282061
Substrate/Competitorn/a
Meas. Tech.ChEMBL_208018 (CHEMBL814147)
IC50 3000±n/a nM
Citation Kim, CUMisco, PFLuh, BYTerry, BBisacchi, GMansuri, MM (2R, 4S, 5S)-1-(tetrahydro-4-hydroxy-5-methoxy-2-furanyl)thymine: a potent selective inhibitor of herpes simplex thymidine kinase Bioorg Med Chem Lett3:1571-1576 (1993)    Article
 
Thymidine kinase, cytosolic
Name:Thymidine kinase, cytosolic
Type:PROTEIN
Mol. Mass.:25476.50
Organism:Homo sapiens (Human)
Description:ChEMBL_1333884
Residue:234
BDBM50282061
NameBDBM50282061
Synonyms:1-((2R,4S,5R)-5-Ethynyl-4-hydroxy-tetrahydro-furan-2-yl)-5-methyl-1H-pyrimidine-2,4-dione | CHEMBL289100
TypeSmall organic molecule
Emp. Form.C11H12N2O4
Mol. Mass.236.224
SMILESCc1cn([C@H]2C[C@H](O)[C@H](O2)C#C)c(=O)[nH]c1=O