Reaction Details
TargetThymidine kinase, cytosolic
LigandBDBM50282072
Substrate/Competitorn/a
Meas. Tech.ChEMBL_208018 (CHEMBL814147)
IC50 25000±n/a nM
Citation Kim, CUMisco, PFLuh, BYTerry, BBisacchi, GMansuri, MM (2R, 4S, 5S)-1-(tetrahydro-4-hydroxy-5-methoxy-2-furanyl)thymine: a potent selective inhibitor of herpes simplex thymidine kinase Bioorg Med Chem Lett3:1571-1576 (1993)    Article
 
Thymidine kinase, cytosolic
Name:Thymidine kinase, cytosolic
Type:PROTEIN
Mol. Mass.:25476.50
Organism:Homo sapiens (Human)
Description:ChEMBL_1333884
Residue:234
BDBM50282072
NameBDBM50282072
Synonyms:1-((2R,4S,5S)-4-Hydroxy-5-phenethyloxy-tetrahydro-furan-2-yl)-5-methyl-1H-pyrimidine-2,4-dione | CHEMBL289626
TypeSmall organic molecule
Emp. Form.C17H20N2O5
Mol. Mass.332.3511
SMILESCc1cn([C@H]2C[C@H](O)[C@@H](OCCc3ccccc3)O2)c(=O)[nH]c1=O