Reaction Details
TargetType-1 angiotensin II receptor
LigandBDBM50282277
Substrate/Competitorn/a
Meas. Tech.ChEMBL_36945 (CHEMBL648848)
IC50 0.11±n/a nM
Citation Mantlo, NBKim, DOndeyka, DChang, RSKivlighn, SDSiegl, PKGreenlee, WJ Imidazo[4,5-b]pyridine-based AT1 / AT2 angiotensin II receptor antagonists Bioorg Med Chem Lett4:17-22 (1994)    Article
 
Type-1 angiotensin II receptor
Name:Type-1 angiotensin II receptor
Type:Enzyme Catalytic Domain
Mol. Mass.:41009.15
Organism:RABBIT
Description:ANGIOTENSIN AT1 AGTR1 RABBIT::P34976
Residue:359
BDBM50282277
NameBDBM50282277
Synonyms:CHEMBL306407 | Imidazo[4,5-b]pyridine derivative
TypeSmall organic molecule
Emp. Form.C34H43N5O5S
Mol. Mass.633.801
SMILESCCCCOC(=O)NS(=O)(=O)c1ccccc1-c1ccc(Cn2c(CCCC)nc3cc(NC(=O)CCCC)c(C)nc23)cc1