Reaction Details
TargetType-1 angiotensin II receptor
LigandBDBM50282276
Substrate/Competitorn/a
Meas. Tech.ChEMBL_36945 (CHEMBL648848)
IC50 0.1±n/a nM
Citation Mantlo, NBKim, DOndeyka, DChang, RSKivlighn, SDSiegl, PKGreenlee, WJ Imidazo[4,5-b]pyridine-based AT1 / AT2 angiotensin II receptor antagonists Bioorg Med Chem Lett4:17-22 (1994)    Article
 
Type-1 angiotensin II receptor
Name:Type-1 angiotensin II receptor
Type:Enzyme Catalytic Domain
Mol. Mass.:41009.15
Organism:RABBIT
Description:ANGIOTENSIN AT1 AGTR1 RABBIT::P34976
Residue:359
BDBM50282276
NameBDBM50282276
Synonyms:CHEMBL304947 | Pentanoic acid {2-butyl-3-[2'-(3-cyclopentyl-propionylsulfamoyl)-biphenyl-4-ylmethyl]-5-methyl-3H-imidazo[4,5-b]pyridin-6-yl}-amide
TypeSmall organic molecule
Emp. Form.C37H47N5O4S
Mol. Mass.657.865
SMILESCCCCC(=O)Nc1cc2nc(CCCC)n(Cc3ccc(cc3)-c3ccccc3S(=O)(=O)NC(=O)CCC3CCCC3)c2nc1C