Reaction Details
TargetType-1 angiotensin II receptor
LigandBDBM50282274
Substrate/Competitorn/a
Meas. Tech.ChEMBL_36945 (CHEMBL648848)
IC50 0.1±n/a nM
Citation Mantlo, NBKim, DOndeyka, DChang, RSKivlighn, SDSiegl, PKGreenlee, WJ Imidazo[4,5-b]pyridine-based AT1 / AT2 angiotensin II receptor antagonists Bioorg Med Chem Lett4:17-22 (1994)    Article
 
Type-1 angiotensin II receptor
Name:Type-1 angiotensin II receptor
Type:Enzyme Catalytic Domain
Mol. Mass.:41009.15
Organism:RABBIT
Description:ANGIOTENSIN AT1 AGTR1 RABBIT::P34976
Residue:359
BDBM50282274
NameBDBM50282274
Synonyms:4'-(2-Ethyl-5,7-dimethyl-imidazo[4,5-b]pyridin-3-ylmethyl)-biphenyl-2-sulfonic acid (3-cyclopentyl-propionyl)-amide | CHEMBL68638
TypeSmall organic molecule
Emp. Form.C31H36N4O3S
Mol. Mass.544.708
SMILESCCc1nc2c(C)cc(C)nc2n1Cc1ccc(cc1)-c1ccccc1S(=O)(=O)NC(=O)CCC1CCCC1