Reaction Details
TargetType-1 angiotensin II receptor B
LigandBDBM50049201
Substrate/Competitorn/a
Meas. Tech.ChEMBL_34945 (CHEMBL647788)
Ki 2.9±n/a nM
Citation Ryono, DELloyd, JPoss, MABird, JEBuote, JChong, SDejneka, TDickinson, KEGu, ZMathers, PMoreland, SMorrison, RAPetrillo, EWPowell, JRSchaeffer, TSpitzmiller, ERWhite, RE Orally active prodrugs of quinoline-4-carboxylic acid angiotensin II receptor antagonists Bioorg Med Chem Lett4:201-206 (1994)    Article
 
Type-1 angiotensin II receptor B
Name:Type-1 angiotensin II receptor B
Type:Enzyme Catalytic Domain
Mol. Mass.:40929.44
Organism:RAT
Description:Angiotensin II AT1B 0 RAT::P29089
Residue:359
BDBM50049201
NameBDBM50049201
Synonyms:2-Cyclopropyl-3-[2'-(1H-tetrazol-5-yl)-biphenyl-4-ylmethoxy]-quinoline-4-carboxylic acid BMS-183920 | CHEMBL305365
TypeSmall organic molecule
Emp. Form.C27H21N5O3
Mol. Mass.463.4873
SMILESOC(=O)c1c(OCc2ccc(cc2)-c2ccccc2-c2nnn[nH]2)c(nc2ccccc12)C1CC1