Reaction Details
TargetBeta-lactamase TEM
LigandBDBM50282563
Substrate/Competitorn/a
Meas. Tech.ChEBML_164508
Ki 44000±n/a nM
Citation Martin, RGold, MJones, J Inhibition of the RTEM-1 β-lactamase by boronic acids Bioorg Med Chem Lett4:1229-1234 (1994)    Article
 
Beta-lactamase TEM
Name:Beta-lactamase TEM
Type:Enzyme
Mol. Mass.:31512.33
Organism:Escherichia coli
Description:P62593
Residue:286
BDBM50282563
NameBDBM50282563
Synonyms:2-(2-Naphthyl)ethyl boronic acid CHEMBL21848
TypeSmall organic molecule
Emp. Form.C12H13BO2
Mol. Mass.200.041
SMILESOB(O)CCc1ccc2ccccc2c1