Reaction Details
TargetRenin
LigandBDBM50282600
Substrate/Competitorn/a
Meas. Tech.ChEMBL_195791 (CHEMBL801712)
IC50 41±n/a nM
Citation Smith, SAAl-Barazanji, KABuckingham, RECassidy, FColdwell, MCFinney, FJHadley, MSHam, PLawrence, SANash, DJTingley, EJWatson, JM The identification of a novel renin inhibitor of equivalent efficacy following oral or intravenous administration. Bioorg Med Chem Lett4:1291-1296 (1994)    Article
 
Renin
Name:Renin
Type:Enzyme
Mol. Mass.:45058.99
Organism:Homo sapiens (Human)
Description:n/a
Residue:406
BDBM50282600
NameBDBM50282600
Synonyms:(3S,4S)-5-Cyclohexyl-4-((S)-2-{(S)-2-[2-(1,1-dioxo-2,3-dihydro-1H-1lambda*6*-benzo[b]thiophen-3-yl)-acetylamino]-3-phenyl-propionylamino}-4-methyl-pentanoylamino)-3-hydroxy-pentanoic acid (2-imidazol-1-yl-ethyl)-amide | CHEMBL23071
TypeSmall organic molecule
Emp. Form.C41H56N6O7S
Mol. Mass.776.984
SMILESCC(C)C[C@H](NC(=O)[C@H](Cc1ccccc1)NC(=O)CC1CS(=O)(=O)c2ccccc12)C(=O)N[C@@H](CC1CCCCC1)[C@@H](O)CC(=O)NCCn1ccnc1