Reaction Details
Target5-hydroxytryptamine receptor 4
LigandBDBM29526
Substrate/Competitorn/a
Meas. Tech.ChEMBL_3341 (CHEMBL619041)
Ki 1.07±n/a nM
Citation Langlois, MZhang, LBre´mont, BShen, SManara, LCroci, T Design of a potent 5-HT4 receptor agonist with nanomolar affinity Bioorg Med Chem Lett4:1433-1436 (1994)    Article
 
5-hydroxytryptamine receptor 4
Name:5-hydroxytryptamine receptor 4
Type:Enzyme Catalytic Domain
Mol. Mass.:46117.31
Organism:RAT
Description:5-HT4 HTR4 RAT::Q62758
Residue:406
BDBM29526
NameBDBM29526
Synonyms:2-Piperidinoethyl 4-amino-5-chloro-2-methoxybenzoate ML 10302 | ML10302
TypeSmall organic molecule
Emp. Form.C15H21ClN2O3
Mol. Mass.312.792
SMILESCOc1cc(N)c(Cl)cc1C(=O)OCCN1CCCCC1