Reaction Details
TargetRetinoic acid receptor RXR-alpha
LigandBDBM50282693
Substrate/Competitorn/a
Meas. Tech.ChEMBL_164856 (CHEMBL769014)
EC50 275±n/a nM
Citation Beard, RLGil, DWMarler, DKHenry, EColon, DFGillett, SJArefieg, TBreen, TSKrauss, HDavies, PJChandraratna, RA Structural basis for the differential RXR & RAR activity of stilbene retinoid analogs Bioorg Med Chem Lett4:1447-1452 (1994)    Article
 
Retinoic acid receptor RXR-alpha
Name:Retinoic acid receptor RXR-alpha
Type:PROTEIN
Mol. Mass.:50820.38
Organism:Homo sapiens (Human)
Description:ChEMBL_1456363
Residue:462
BDBM50282693
NameBDBM50282693
Synonyms:4-[(E)-2-(3-Chloro-5,5,8,8-tetramethyl-5,6,7,8-tetrahydro-naphthalen-2-yl)-propenyl]-benzoic acid | CHEMBL36464
TypeSmall organic molecule
Emp. Form.C24H27ClO2
Mol. Mass.382.923
SMILESC\C(=C/c1ccc(cc1)C(O)=O)c1cc2c(cc1Cl)C(C)(C)CCC2(C)C